BDBM50039246 (S)-1-(2-(tris(4-methoxyphenyl)methoxy)ethyl)piperidine-3-carboxylic acid::(S)-1-{2-[Tris-(4-methoxy-phenyl)-methoxy]-ethyl}-piperidine-3-carboxylic acid::CHEMBL75035
SMILES COc1ccc(cc1)C(OCCN1CCC[C@@H](C1)C(O)=O)(c1ccc(OC)cc1)c1ccc(OC)cc1
InChI Key InChIKey=VDLDUZLDZBVOAS-QFIPXVFZSA-N
Data  5 KI  54 IC50
  Tab Delimited (TSV)   2D SDfile   Computed 3D by Vconf -m prep SDfile
Find this compound or compounds like it in BindingDB:
Activity Spreadsheet -- Enzyme Inhibition Constant Data from BindingDB
Found 59 hits for monomerid = 50039246
TargetSodium- and chloride-dependent GABA transporter 1(Rattus norvegicus)
Jagiellonian University Medical College
Curated by ChEMBL
LigandPNGBDBM50039246((S)-1-(2-(tris(4-methoxyphenyl)methoxy)ethyl)piper...)
Affinity DataKi:  2.75E+4nM. Assay description: Binding affinity to mouse GAT1 stably transfected in HEK293 cells by NO-711 binding assay
In DepthDetails ArticlePubMed
TargetSodium- and chloride-dependent GABA transporter 1(Rattus norvegicus)
Jagiellonian University Medical College
Curated by ChEMBL
LigandPNGBDBM50039246((S)-1-(2-(tris(4-methoxyphenyl)methoxy)ethyl)piper...)
Affinity DataKi:  2.75E+4nM. Assay description: Displacement of NO711 from mouse GAT1 expressed in stable HEK293 cell membranes preincubated for 10 mins followed by NO711 addition and measured afte...
In DepthDetails ArticlePubMed
TargetSodium- and chloride-dependent GABA transporter 1(Rattus norvegicus)
Jagiellonian University Medical College
Curated by ChEMBL
LigandPNGBDBM50039246((S)-1-(2-(tris(4-methoxyphenyl)methoxy)ethyl)piper...)
Affinity DataKi:  2.75E+4nM. Assay description: Displacement of NO711 from mouse GAT1 expressed in stable HEK293 cell membranes preincubated for 10 mins followed by NO711 addition and measured afte...
In DepthDetails ArticlePubMed
TargetSodium- and chloride-dependent GABA transporter 1(Rattus norvegicus)
Jagiellonian University Medical College
Curated by ChEMBL
LigandPNGBDBM50039246((S)-1-(2-(tris(4-methoxyphenyl)methoxy)ethyl)piper...)
Affinity DataKi:  2.75E+4nM. Assay description: Displacement of NO711 from mouse GAT1 expressed in HEK293 cells by LC-MS/MS analysis
In DepthDetails ArticlePubMed
TargetSodium- and chloride-dependent GABA transporter 1(Rattus norvegicus)
Jagiellonian University Medical College
Curated by ChEMBL
LigandPNGBDBM50039246((S)-1-(2-(tris(4-methoxyphenyl)methoxy)ethyl)piper...)
Affinity DataKi:  2.75E+4nM. Assay description: Inhibition of [2H10]NO 711 binding to mouse GAT1 expressed in HEK293 cell membranes after 40 mins by LC-ESI-MS-MS analysis
In DepthDetails ArticlePubMed
TargetSodium- and chloride-dependent betaine transporter(Homo sapiens (Human))
Synaptic Pharmaceutical
Curated by ChEMBL
LigandPNGBDBM50039246((S)-1-(2-(tris(4-methoxyphenyl)methoxy)ethyl)piper...)
Affinity DataIC50:  1.40E+5nM. Assay description: Inhibition of human GABA transporter (hBGT-1) activity.
In DepthDetails ArticlePubMed
TargetSodium- and chloride-dependent GABA transporter 3(Homo sapiens (Human))
Synaptic Pharmaceutical
Curated by ChEMBL
LigandPNGBDBM50039246((S)-1-(2-(tris(4-methoxyphenyl)methoxy)ethyl)piper...)
Affinity DataIC50:  5.00E+3nM. Assay description: Inhibitory activity against human sodium and chloride dependent GABA transporter 3
In DepthDetails ArticlePubMed
TargetSodium- and chloride-dependent GABA transporter 1(Homo sapiens (Human))
Synaptic Pharmaceutical
Curated by ChEMBL
LigandPNGBDBM50039246((S)-1-(2-(tris(4-methoxyphenyl)methoxy)ethyl)piper...)
Affinity DataIC50:  3.88E+5nM. Assay description: Inhibitory activity against human GABA transporter-1 (hGAT1)
In DepthDetails ArticlePubMed
TargetSodium- and chloride-dependent GABA transporter 1(Rattus norvegicus)
Jagiellonian University Medical College
Curated by ChEMBL
LigandPNGBDBM50039246((S)-1-(2-(tris(4-methoxyphenyl)methoxy)ethyl)piper...)
Affinity DataIC50:  8.51E+4nM. Assay description: Inhibition of mouse GAT1 expressed in HEK293 cells assessed as decrease in [3H]GABA uptake
In DepthDetails ArticlePubMed
TargetSodium- and chloride-dependent GABA transporter 2(Mus musculus)
Jagiellonian University Medical College
Curated by ChEMBL
LigandPNGBDBM50039246((S)-1-(2-(tris(4-methoxyphenyl)methoxy)ethyl)piper...)
Affinity DataIC50:  5.13E+3nM. Assay description: Inhibition of mouse GAT3 expressed in HEK293 cells assessed as decrease in [3H]GABA uptake
In DepthDetails ArticlePubMed
TargetSodium- and chloride-dependent GABA transporter 3(Mus musculus)
Jagiellonian University Medical College
Curated by ChEMBL
LigandPNGBDBM50039246((S)-1-(2-(tris(4-methoxyphenyl)methoxy)ethyl)piper...)
Affinity DataIC50:  1.95E+3nM. Assay description: Inhibition of mouse GAT4 expressed in HEK293 cells assessed as decrease in [3H]GABA uptake
In DepthDetails ArticlePubMed
TargetSodium- and chloride-dependent GABA transporter 3(Mus musculus)
Jagiellonian University Medical College
Curated by ChEMBL
LigandPNGBDBM50039246((S)-1-(2-(tris(4-methoxyphenyl)methoxy)ethyl)piper...)
Affinity DataIC50:  2.20E+4nM. Assay description: Inhibition of mouse GAT3-mediated [3H]GABA uptake expressed in human HEK cells
In DepthDetails ArticlePubMed
TargetSodium- and chloride-dependent GABA transporter 1(Rattus norvegicus)
Jagiellonian University Medical College
Curated by ChEMBL
LigandPNGBDBM50039246((S)-1-(2-(tris(4-methoxyphenyl)methoxy)ethyl)piper...)
Affinity DataIC50:  8.51E+4nM. Assay description: Inhibition of mouse GAT1 expressed in HEK293 cells by [3H]GABA uptake assay
In DepthDetails ArticlePubMed
TargetSodium-dependent dopamine transporter(MOUSE)
Ludwig-Maximilians-Universit£T M£Nchen
Curated by ChEMBL
LigandPNGBDBM50039246((S)-1-(2-(tris(4-methoxyphenyl)methoxy)ethyl)piper...)
Affinity DataIC50:  5.01E+3nM. Assay description: Inhibition of mouse GAT3 expressed in HEK293 cells by [3H]GABA uptake assay
In DepthDetails ArticlePubMed
TargetSodium-dependent serotonin transporter(MOUSE)
Ludwig-Maximilians-Universit£T M£Nchen
Curated by ChEMBL
LigandPNGBDBM50039246((S)-1-(2-(tris(4-methoxyphenyl)methoxy)ethyl)piper...)
Affinity DataIC50:  1.55E+3nM. Assay description: Inhibition of mouse GAT4 expressed in HEK293 cells by [3H]GABA uptake assay
In DepthDetails ArticlePubMed
TargetSodium- and chloride-dependent betaine transporter(Mus musculus)
University Of Copenhagen
Curated by ChEMBL
LigandPNGBDBM50039246((S)-1-(2-(tris(4-methoxyphenyl)methoxy)ethyl)piper...)
Affinity DataIC50:  2.20E+4nM. Assay description: Inhibition of mouse mGAT2 expressed in HEK293 cells assessed as inhibition of [3H]GABA uptake after 3 mins incubation by TopCount microplate scintill...
In DepthDetails ArticlePubMed
TargetSodium- and chloride-dependent GABA transporter 1(Rattus norvegicus)
Jagiellonian University Medical College
Curated by ChEMBL
LigandPNGBDBM50039246((S)-1-(2-(tris(4-methoxyphenyl)methoxy)ethyl)piper...)
Affinity DataIC50: >3.00E+4nM. Assay description: Inhibition of mouse mGAT1 expressed in HEK293 cells assessed as inhibition of [3H]GABA uptake after 3 mins incubation by TopCount microplate scintill...
In DepthDetails ArticlePubMed
TargetSodium- and chloride-dependent GABA transporter 3(Mus musculus)
Jagiellonian University Medical College
Curated by ChEMBL
LigandPNGBDBM50039246((S)-1-(2-(tris(4-methoxyphenyl)methoxy)ethyl)piper...)
Affinity DataIC50:  6.00E+3nM. Assay description: Inhibition of mouse mGAT4 expressed in HEK293 cells assessed as inhibition of [3H]GABA uptake after 3 mins incubation by TopCount microplate scintill...
In DepthDetails ArticlePubMed
TargetSodium- and chloride-dependent GABA transporter 2(Mus musculus)
Jagiellonian University Medical College
Curated by ChEMBL
LigandPNGBDBM50039246((S)-1-(2-(tris(4-methoxyphenyl)methoxy)ethyl)piper...)
Affinity DataIC50:  2.00E+4nM. Assay description: Inhibition of mouse mGAT3 expressed in HEK293 cells assessed as inhibition of [3H]GABA uptake after 3 mins incubation by TopCount microplate scintill...
In DepthDetails ArticlePubMed
TargetSodium- and chloride-dependent GABA transporter 3(Homo sapiens (Human))
Synaptic Pharmaceutical
Curated by ChEMBL
LigandPNGBDBM50039246((S)-1-(2-(tris(4-methoxyphenyl)methoxy)ethyl)piper...)
Affinity DataIC50:  1.12E+3nM. Assay description: Inhibition of human GAT3 transfected in CHO cells assessed as [3H]GABA uptake after 20 mins by liquid scintillation counting analysis
In DepthDetails ArticlePubMed
TargetSodium- and chloride-dependent GABA transporter 2(Homo sapiens (Human))
Hokkaido University
Curated by ChEMBL
LigandPNGBDBM50039246((S)-1-(2-(tris(4-methoxyphenyl)methoxy)ethyl)piper...)
Affinity DataIC50:  1.19E+4nM. Assay description: Inhibition of human GAT2 transfected in CHO cells assessed as [3H]GABA uptake after 20 mins by liquid scintillation counting analysis
In DepthDetails ArticlePubMed
TargetSodium- and chloride-dependent GABA transporter 1(Homo sapiens (Human))
Synaptic Pharmaceutical
Curated by ChEMBL
LigandPNGBDBM50039246((S)-1-(2-(tris(4-methoxyphenyl)methoxy)ethyl)piper...)
Affinity DataIC50: >1.00E+5nM. Assay description: Inhibition of human GAT1 transfected in CHO cells assessed as [3H]GABA uptake after 20 mins by liquid scintillation counting analysis
In DepthDetails ArticlePubMed
TargetSodium- and chloride-dependent betaine transporter(Homo sapiens (Human))
Synaptic Pharmaceutical
Curated by ChEMBL
LigandPNGBDBM50039246((S)-1-(2-(tris(4-methoxyphenyl)methoxy)ethyl)piper...)
Affinity DataIC50:  7.17E+4nM. Assay description: Inhibition of human BGT1 transfected in CHO cells assessed as [3H]GABA uptake after 20 mins by liquid scintillation counting analysis
In DepthDetails ArticlePubMed
TargetSodium- and chloride-dependent GABA transporter 2(Mus musculus)
Jagiellonian University Medical College
Curated by ChEMBL
LigandPNGBDBM50039246((S)-1-(2-(tris(4-methoxyphenyl)methoxy)ethyl)piper...)
Affinity DataIC50:  2.19E+4nM. Assay description: Inhibition of mouse GAT2 mediated [3]GABA uptake expressed in HEK293 cells after 3 mins by scintillation counting
In DepthDetails ArticlePubMed
TargetSodium- and chloride-dependent GABA transporter 3(Mus musculus)
Jagiellonian University Medical College
Curated by ChEMBL
LigandPNGBDBM50039246((S)-1-(2-(tris(4-methoxyphenyl)methoxy)ethyl)piper...)
Affinity DataIC50:  6.30E+3nM. Assay description: Inhibition of mouse GAT3 mediated [3]GABA uptake expressed in HEK293 cells after 3 mins by scintillation counting
In DepthDetails ArticlePubMed
TargetSodium- and chloride-dependent GABA transporter 1(Rattus norvegicus)
Jagiellonian University Medical College
Curated by ChEMBL
LigandPNGBDBM50039246((S)-1-(2-(tris(4-methoxyphenyl)methoxy)ethyl)piper...)
Affinity DataIC50:  1.99E+5nM. Assay description: Inhibition of mouse GAT1 mediated [3]GABA uptake expressed in HEK293 cells after 3 mins by scintillation counting
In DepthDetails ArticlePubMed
TargetSodium- and chloride-dependent betaine transporter(Mus musculus)
University Of Copenhagen
Curated by ChEMBL
LigandPNGBDBM50039246((S)-1-(2-(tris(4-methoxyphenyl)methoxy)ethyl)piper...)
Affinity DataIC50: >1.00E+6nM. Assay description: Inhibition of mouse BGT1 mediated [3]GABA uptake expressed in HEK293 cells after 3 mins by scintillation counting
In DepthDetails ArticlePubMed
TargetSodium- and chloride-dependent GABA transporter 3(Homo sapiens (Human))
Synaptic Pharmaceutical
Curated by ChEMBL
LigandPNGBDBM50039246((S)-1-(2-(tris(4-methoxyphenyl)methoxy)ethyl)piper...)
Affinity DataIC50:  5.00E+3nM. Assay description: Binding affinity to GAT3
In DepthDetails ArticlePubMed
TargetSodium- and chloride-dependent GABA transporter 1(Mus musculus)
Ludwig-Maximilians-University Munich
Curated by ChEMBL
LigandPNGBDBM50039246((S)-1-(2-(tris(4-methoxyphenyl)methoxy)ethyl)piper...)
Affinity DataIC50:  8.50E+4nM. Assay description: Inhibition of mouse GAT1-mediated [3H]GABA uptake expressed in human HEK cells
In DepthDetails ArticlePubMed
TargetSodium- and chloride-dependent GABA transporter 2(Mus musculus)
Jagiellonian University Medical College
Curated by ChEMBL
LigandPNGBDBM50039246((S)-1-(2-(tris(4-methoxyphenyl)methoxy)ethyl)piper...)
Affinity DataIC50:  3.50E+4nM. Assay description: Inhibition of mouse GAT2-mediated [3H]GABA uptake expressed in human HEK cells
In DepthDetails ArticlePubMed
TargetSodium- and chloride-dependent GABA transporter 1(Homo sapiens (Human))
Synaptic Pharmaceutical
Curated by ChEMBL
LigandPNGBDBM50039246((S)-1-(2-(tris(4-methoxyphenyl)methoxy)ethyl)piper...)
Affinity DataIC50:  3.89E+5nM. Assay description: Inhibition of human GAT1 assessed as [3H]GABA uptake
In DepthDetails ArticlePubMed
TargetSodium- and chloride-dependent betaine transporter(Homo sapiens (Human))
Synaptic Pharmaceutical
Curated by ChEMBL
LigandPNGBDBM50039246((S)-1-(2-(tris(4-methoxyphenyl)methoxy)ethyl)piper...)
Affinity DataIC50:  1.41E+5nM. Assay description: Inhibition of human BGT1 assessed as [3H]GABA uptake
In DepthDetails ArticlePubMed
TargetSodium- and chloride-dependent GABA transporter 2(Rattus norvegicus)
Ludwig-Maximilians-University Munich
Curated by ChEMBL
LigandPNGBDBM50039246((S)-1-(2-(tris(4-methoxyphenyl)methoxy)ethyl)piper...)
Affinity DataIC50:  2.09E+4nM. Assay description: Inhibition of rat GAT2 assessed as [3H]GABA uptake
In DepthDetails ArticlePubMed
TargetSodium- and chloride-dependent GABA transporter 3(Homo sapiens (Human))
Synaptic Pharmaceutical
Curated by ChEMBL
LigandPNGBDBM50039246((S)-1-(2-(tris(4-methoxyphenyl)methoxy)ethyl)piper...)
Affinity DataIC50:  5.01E+3nM. Assay description: Inhibition of human GAT3 assessed as [3H]GABA uptake
In DepthDetails ArticlePubMed
TargetSodium- and chloride-dependent GABA transporter 3(Mus musculus)
Jagiellonian University Medical College
Curated by ChEMBL
LigandPNGBDBM50039246((S)-1-(2-(tris(4-methoxyphenyl)methoxy)ethyl)piper...)
Affinity DataIC50:  5.13E+3nM. Assay description: Inhibition of mouse GAT3 expressed in HEK293 cells assessed as decrease in [3H]GABA uptake preincubated for 25 mins followed by [3H]GABA addition mea...
In DepthDetails ArticlePubMed
TargetSodium- and chloride-dependent GABA transporter 3(Mus musculus)
Jagiellonian University Medical College
Curated by ChEMBL
LigandPNGBDBM50039246((S)-1-(2-(tris(4-methoxyphenyl)methoxy)ethyl)piper...)
Affinity DataIC50:  1.95E+3nM. Assay description: Inhibition of mouse GAT4 expressed in HEK293 cells assessed as decrease in [3H]GABA uptake preincubated for 25 mins followed by [3H]GABA addition mea...
In DepthDetails ArticlePubMed
TargetSodium- and chloride-dependent GABA transporter 1(Rattus norvegicus)
Jagiellonian University Medical College
Curated by ChEMBL
LigandPNGBDBM50039246((S)-1-(2-(tris(4-methoxyphenyl)methoxy)ethyl)piper...)
Affinity DataIC50:  8.51E+4nM. Assay description: Inhibition of mouse GAT1 expressed in HEK293 cells assessed as decrease in [3H]GABA uptake preincubated for 25 mins followed by [3H]GABA addition mea...
In DepthDetails ArticlePubMed
TargetSodium- and chloride-dependent GABA transporter 1(Rattus norvegicus)
Jagiellonian University Medical College
Curated by ChEMBL
LigandPNGBDBM50039246((S)-1-(2-(tris(4-methoxyphenyl)methoxy)ethyl)piper...)
Affinity DataIC50:  8.51E+4nM. Assay description: Inhibition of mouse GAT1-mediated [3H]GABA uptake stably transfected in HEK293 cells
In DepthDetails ArticlePubMed
TargetSodium- and chloride-dependent GABA transporter 3(Mus musculus)
Jagiellonian University Medical College
Curated by ChEMBL
LigandPNGBDBM50039246((S)-1-(2-(tris(4-methoxyphenyl)methoxy)ethyl)piper...)
Affinity DataIC50:  2.24E+3nM. Assay description: Inhibition of mouse GAT4 expressed in HEK cells assessed as reduction in [3H]GABA uptake by measuring remaining [3H]GABA uptake levels preincubated f...
In DepthDetails ArticlePubMed
TargetSodium- and chloride-dependent GABA transporter 3(Mus musculus)
Jagiellonian University Medical College
Curated by ChEMBL
LigandPNGBDBM50039246((S)-1-(2-(tris(4-methoxyphenyl)methoxy)ethyl)piper...)
Affinity DataIC50:  5.13E+3nM. Assay description: Inhibition of mouse GAT3 expressed in HEK cells assessed as reduction in [3H]GABA uptake by measuring remaining [3H]GABA uptake levels preincubated f...
In DepthDetails ArticlePubMed
TargetSodium- and chloride-dependent GABA transporter 3(Homo sapiens (Human))
Synaptic Pharmaceutical
Curated by ChEMBL
LigandPNGBDBM50039246((S)-1-(2-(tris(4-methoxyphenyl)methoxy)ethyl)piper...)
Affinity DataIC50:  3.31E+3nM. Assay description: Inhibition of human GAT3 expressed in COS7 cells assessed as reduction in [2H6]GABA uptake preincubated for 25 mins followed by [2H6]GABA addition an...
In DepthDetails ArticlePubMed
TargetSodium- and chloride-dependent GABA transporter 1(Rattus norvegicus)
Jagiellonian University Medical College
Curated by ChEMBL
LigandPNGBDBM50039246((S)-1-(2-(tris(4-methoxyphenyl)methoxy)ethyl)piper...)
Affinity DataIC50:  8.51E+4nM. Assay description: Inhibition of mouse GAT1 expressed in HEK cells assessed as reduction in [3H]GABA uptake by measuring remaining [3H]GABA uptake levels preincubated f...
In DepthDetails ArticlePubMed
TargetSodium- and chloride-dependent GABA transporter 1(Rattus norvegicus)
Jagiellonian University Medical College
Curated by ChEMBL
LigandPNGBDBM50039246((S)-1-(2-(tris(4-methoxyphenyl)methoxy)ethyl)piper...)
Affinity DataIC50:  8.51E+4nM. Assay description: Inhibition of mouse GAT1 expressed in HEK293 cells assessed as reduction in [3H]GABA uptake preincubated for 25 mins followed by [3H]GABA addition an...
In DepthDetails ArticlePubMed
TargetSodium- and chloride-dependent GABA transporter 3(Mus musculus)
Jagiellonian University Medical College
Curated by ChEMBL
LigandPNGBDBM50039246((S)-1-(2-(tris(4-methoxyphenyl)methoxy)ethyl)piper...)
Affinity DataIC50:  5.13E+3nM. Assay description: Inhibition of mouse GAT3 expressed in HEK293 cells assessed as reduction in [3H]GABA uptake preincubated for 25 mins followed by [3H]GABA addition an...
In DepthDetails ArticlePubMed
TargetSodium- and chloride-dependent GABA transporter 3(Mus musculus)
Jagiellonian University Medical College
Curated by ChEMBL
LigandPNGBDBM50039246((S)-1-(2-(tris(4-methoxyphenyl)methoxy)ethyl)piper...)
Affinity DataIC50:  5.13E+3nM. Assay description: Inhibition of mouse GAT3 expressed in HEK293 cells assessed as reduction in [3H]GABA uptake preincubated for 25 mins followed by [3H]GABA addition an...
In DepthDetails ArticlePubMed
TargetSodium- and chloride-dependent GABA transporter 1(Rattus norvegicus)
Jagiellonian University Medical College
Curated by ChEMBL
LigandPNGBDBM50039246((S)-1-(2-(tris(4-methoxyphenyl)methoxy)ethyl)piper...)
Affinity DataIC50:  8.51E+4nM. Assay description: Inhibition of mouse GAT1 expressed in HEK293 cells assessed as reduction in [3H]GABA uptake preincubated for 25 mins followed by [3H]GABA addition an...
In DepthDetails ArticlePubMed
TargetSodium- and chloride-dependent GABA transporter 3(Mus musculus)
Jagiellonian University Medical College
Curated by ChEMBL
LigandPNGBDBM50039246((S)-1-(2-(tris(4-methoxyphenyl)methoxy)ethyl)piper...)
Affinity DataIC50:  1.95E+3nM. Assay description: Inhibition of mouse GAT4 expressed in HEK293 cells assessed as reduction in [3H]GABA uptake preincubated for 25 mins followed by [3H]GABA addition an...
In DepthDetails ArticlePubMed
TargetSodium- and chloride-dependent GABA transporter 3(Mus musculus)
Jagiellonian University Medical College
Curated by ChEMBL
LigandPNGBDBM50039246((S)-1-(2-(tris(4-methoxyphenyl)methoxy)ethyl)piper...)
Affinity DataIC50:  1.95E+3nM. Assay description: Inhibition of mouse GAT4 expressed in HEK293 cells assessed as reduction in [3H]GABA uptake preincubated for 25 mins followed by [3H]GABA addition an...
In DepthDetails ArticlePubMed
TargetSodium- and chloride-dependent GABA transporter 3(Mus musculus)
Jagiellonian University Medical College
Curated by ChEMBL
LigandPNGBDBM50039246((S)-1-(2-(tris(4-methoxyphenyl)methoxy)ethyl)piper...)
Affinity DataIC50:  1.55E+3nM. Assay description: Inhibition of mouse GAT4 expressed in HEK293 cell line assessed as inhibition of [3H]GABA uptake measured after 35 mins by liquid scintillation metho...
In DepthDetails ArticlePubMed
TargetSodium- and chloride-dependent GABA transporter 3(Mus musculus)
Jagiellonian University Medical College
Curated by ChEMBL
LigandPNGBDBM50039246((S)-1-(2-(tris(4-methoxyphenyl)methoxy)ethyl)piper...)
Affinity DataIC50:  5.13E+3nM. Assay description: Inhibition of mouse GAT3 expressed in HEK293 cell line assessed as inhibition of [3H]GABA uptake measured after 35 mins by liquid scintillation metho...
In DepthDetails ArticlePubMed
Displayed 1 to 50 (of 59 total ) | Next | Last >>