BDBM50039361 2,5-Dimethyl-7-propyl-8-[2'-(1H-tetrazol-5-yl)-biphenyl-4-ylmethyl]-2H-[1,2,4]triazolo[4,3-c]pyrimidin-3-one::CHEMBL76421
SMILES CCCc1nc(C)n2c(nn(C)c2=O)c1Cc1ccc(cc1)-c1ccccc1-c1nnn[nH]1
InChI Key InChIKey=CJCGCOGXWYIGGD-UHFFFAOYSA-N
Data  1 KI
  Tab Delimited (TSV)   2D SDfile   Computed 3D by Vconf -m prep SDfile
Find this compound or compounds like it in BindingDB:
Activity Spreadsheet -- Enzyme Inhibition Constant Data from BindingDB
Found 1 hit for monomerid = 50039361
TargetType-1 angiotensin II receptor B(RAT)
Carpibem
Curated by ChEMBL
LigandPNGBDBM50039361(2,5-Dimethyl-7-propyl-8-[2'-(1H-tetrazol-5-yl)-bip...)
Affinity DataKi:  53nM. Assay description: Displacement of [125I]-Sar1-Ile8-A II from rat adrenal Angiotensin-1 (AT-1) receptor
In DepthDetails ArticlePubMed