BDBM50039374 5-Methyl-7-propyl-8-[2'-(1H-tetrazol-5-yl)-biphenyl-4-ylmethyl]-[1,2,4]triazolo[1,5-c]pyrimidine::CHEMBL309384
SMILES CCCc1nc(C)n2ncnc2c1Cc1ccc(cc1)-c1ccccc1-c1nnn[nH]1
InChI Key InChIKey=FWZKQZUEJPQQDN-UHFFFAOYSA-N
Data  1 KI
  Tab Delimited (TSV)   2D SDfile   Computed 3D by Vconf -m prep SDfile
Find this compound or compounds like it in BindingDB:
Activity Spreadsheet -- Enzyme Inhibition Constant Data from BindingDB
Found 1 hit for monomerid = 50039374
TargetType-1 angiotensin II receptor B(RAT)
Carpibem
Curated by ChEMBL
LigandPNGBDBM50039374(5-Methyl-7-propyl-8-[2'-(1H-tetrazol-5-yl)-bipheny...)
Affinity DataKi:  12nM. Assay description: Displacement of [125I]-Sar1-Ile8-A II from rat adrenal Angiotensin-1 (AT-1) receptor
In DepthDetails ArticlePubMed