BDBM50039461 CHEMBL3357311
SMILES CC(CNC(=O)c1cc2ccccc2[nH]1)N1CCC2(CC1)N(CNC2=O)c1ccccc1
InChI Key
Data  2 IC50
  Tab Delimited (TSV)   2D SDfile   Computed 3D by Vconf -m prep SDfile
Find this compound or compounds like it in BindingDB:
Activity Spreadsheet -- Enzyme Inhibition Constant Data from BindingDB
Found 2 hits for monomerid = 50039461
TargetPhospholipase D1(Homo sapiens (Human))
Vanderbilt University
Curated by ChEMBL
LigandPNGBDBM50039461(CHEMBL3357311)
Affinity DataIC50:  21nM. Assay description: Inhibition of PLD1 (unknown origin) expressed in human Calu1 cells by cell-based assay
In DepthDetails ArticlePubMed
TargetPhospholipase D1(Homo sapiens (Human))
Vanderbilt University
Curated by ChEMBL
LigandPNGBDBM50039461(CHEMBL3357311)
Affinity DataIC50:  6nM. Assay description: Inhibition of PLD2 (unknown origin) expressed in HEK293-gfp cells by cell-based assay
In DepthDetails ArticlePubMed