BDBM50039584 (R)-2-(Butane-1-sulfonylamino)-3-[4-(4-piperidin-4-yl-butoxy)-phenyl]-propionic acid::CHEMBL88012
SMILES CCCCS(=O)(=O)N[C@H](Cc1ccc(OCCCCC2CCNCC2)cc1)C(O)=O
InChI Key InChIKey=COKMIXFXJJXBQG-OAQYLSRUSA-N
Data  1 IC50
  Tab Delimited (TSV)   2D SDfile   Computed 3D by Vconf -m prep SDfile
Find this compound or compounds like it in BindingDB:
Activity Spreadsheet -- Enzyme Inhibition Constant Data from BindingDB
Found 1 hit for monomerid = 50039584
TargetIntegrin alpha-IIb/beta-3(Homo sapiens (Human))
Merck Research Laboratories
Curated by ChEMBL
LigandPNGBDBM50039584((R)-2-(Butane-1-sulfonylamino)-3-[4-(4-piperidin-4...)
Affinity DataIC50:  800nM. Assay description: Inhibition of platelet aggregation as the concentration necessary to inhibit the change in light .
In DepthDetails ArticlePubMed