BDBM50039624 1-(4-iodobenzyl)-3-spiro[2,3-dihydro-1H-indene-1,4'-(hexahydropyridine)]-1-yl-(3R,4R)-hexahydro-4-pyridinol::CHEMBL314687
SMILES O[C@@H]1CCN(Cc2ccc(I)cc2)C[C@H]1N1CCC2(CCc3ccccc23)CC1
InChI Key InChIKey=CNWRMMVDPFBJGC-DNQXCXABSA-N
Data  1 KI
  Tab Delimited (TSV)   2D SDfile   Computed 3D by Vconf -m prep SDfile
Find this compound or compounds like it in BindingDB:
Activity Spreadsheet -- Enzyme Inhibition Constant Data from BindingDB
Found 1 hit for monomerid = 50039624
TargetVesicular acetylcholine transporter(Torpedo californica)
University Of Minnesota
Curated by ChEMBL
LigandPNGBDBM50039624(1-(4-iodobenzyl)-3-spiro[2,3-dihydro-1H-indene-1,4...)
Affinity DataKi:  0.800nM. Assay description: In vitro binding affinity to vesamicol receptor using [3H]-vesamicol.
In DepthDetails ArticlePubMed