BDBM50039665 CHEMBL90649::CHIR-4531::N-Benzo[1,3]dioxol-5-ylmethyl-N-({carbamoylmethyl-[2-(4-hydroxy-phenyl)-ethyl]-carbamoyl}-methyl)-2-(2,2-diphenyl-ethylamino)-acetamide
SMILES NC(=O)CN(CCc1ccc(O)cc1)C(=O)CN(Cc1ccc2OCOc2c1)C(=O)CNCC(c1ccccc1)c1ccccc1
InChI Key InChIKey=XIYXIBKKOHEHTJ-UHFFFAOYSA-N
Data  1 KI
  Tab Delimited (TSV)   2D SDfile   Computed 3D by Vconf -m prep SDfile
Find this compound or compounds like it in BindingDB:
Activity Spreadsheet -- Enzyme Inhibition Constant Data from BindingDB
Found 1 hit for monomerid = 50039665
TargetMu-type opioid receptor(Rattus norvegicus (rat))
Chiron
Curated by ChEMBL
LigandPNGBDBM50039665(CHEMBL90649 | CHIR-4531 | N-Benzo[1,3]dioxol-5-ylm...)
Affinity DataKi:  6nM. Assay description: Compound was evaluated for binding affinity towards mu-specific opiate receptor from rat brain membrane using [3H]DAMGO
In DepthDetails ArticlePubMed