BDBM50039977 (3S,8R)-3-(4-Amino-3-bromo-phenyl)-8-methyl-8-aza-bicyclo[3.2.1]octane-2-carboxylic acid methyl ester
SMILES COC(=O)C1C2CCC(C[C@@H]1c1ccc(N)c(Br)c1)N2C
InChI Key InChIKey=LDJPMOIHMAEPSX-HYMRGOADSA-N
Data  1 IC50
  Tab Delimited (TSV)   2D SDfile   Computed 3D by Vconf -m prep SDfile
Find this compound or compounds like it in BindingDB:
Activity Spreadsheet -- Enzyme Inhibition Constant Data from BindingDB
Found 1 hit for monomerid = 50039977
TargetSodium-dependent dopamine transporter(Rattus norvegicus (rat))
Research Triangle Institute
Curated by ChEMBL
LigandPNGBDBM50039977((3S,8R)-3-(4-Amino-3-bromo-phenyl)-8-methyl-8-aza-...)
Affinity DataIC50:  3.90nM. Assay description: Concentration required to inhibit 50% of radioligand binding ([3H]WIN-35428) to the dopamine (DA) transporter in rat
In DepthDetails ArticlePubMed