BDBM50040160 CHEMBL3359492
SMILES Cl.COc1ccc(\C=C2/Oc3cc(OCCCN4CCCC4)ccc3C2=O)cc1OC
InChI Key InChIKey=DJTXZERBEIKYGC-HNALGXGESA-N
Data  1 IC50
  Tab Delimited (TSV)   2D SDfile   Computed 3D by Vconf -m prep SDfile
Find this compound or compounds like it in BindingDB:
Activity Spreadsheet -- Enzyme Inhibition Constant Data from BindingDB
Found 1 hit for monomerid = 50040160
TargetAcetylcholinesterase(Mus musculus (mouse))
Kyung Hee University
Curated by ChEMBL
LigandPNGBDBM50040160(CHEMBL3359492)
Affinity DataIC50:  1.03E+3nM. Assay description: Inhibition of ICR mouse brain AChE using acetylthiocholine iodide as substrate preincubated for 10 mins before substrate addition by modified Ellman'...
In DepthDetails ArticlePubMed