BDBM50040195 1-Benzo[b]thiophen-2-yl-cyclopentylamine::CHEMBL18502
SMILES NC1(CCCC1)c1cc2ccccc2s1
InChI Key InChIKey=CHUXWBUYFQVPQD-UHFFFAOYSA-N
Data  1 KI  2 IC50
  Tab Delimited (TSV)   2D SDfile   Computed 3D by Vconf -m prep SDfile
Find this compound or compounds like it in BindingDB:
Activity Spreadsheet -- Enzyme Inhibition Constant Data from BindingDB
Found 3 hits for monomerid = 50040195
TargetSigma non-opioid intracellular receptor 1(Homo sapiens (Human))
National Institute Of Diabetes And Digestive And Kidney Diseases
Curated by ChEMBL
LigandPNGBDBM50040195(1-Benzo[b]thiophen-2-yl-cyclopentylamine | CHEMBL1...)
Affinity DataKi:  1.73E+3nM. Assay description: Inhibition of [3H](+)-pentazocine binding to sigma receptor of guinea pig brain homogenates
In DepthDetails ArticlePubMed
TargetSodium-dependent dopamine transporter(Rattus norvegicus (rat))
National Institute Of Diabetes And Digestive And Kidney Diseases
Curated by ChEMBL
LigandPNGBDBM50040195(1-Benzo[b]thiophen-2-yl-cyclopentylamine | CHEMBL1...)
Affinity DataIC50:  933nM. Assay description: Inhibition of [3H]cocaine binding to rat forebrain dopamine receptor
In DepthDetails ArticlePubMed
TargetSodium-dependent dopamine transporter(Rattus norvegicus (rat))
National Institute Of Diabetes And Digestive And Kidney Diseases
Curated by ChEMBL
LigandPNGBDBM50040195(1-Benzo[b]thiophen-2-yl-cyclopentylamine | CHEMBL1...)
Affinity DataIC50:  630nM. Assay description: Displacement of [3H]BTCP (1-[1-(2-benxo[b]thienyl)cyclohexyl]piperidine) from rat forebrain dopamine transporter
In DepthDetails ArticlePubMed