BDBM50040197 1-(1-Benzo[b]thiophen-2-yl-cycloheptyl)-pyrrolidine::CHEMBL279873
SMILES C1CCN(C1)C1(CCCCCC1)c1cc2ccccc2s1
InChI Key InChIKey=HZVAQEFQPWEONV-UHFFFAOYSA-N
Data  1 KI  2 IC50
  Tab Delimited (TSV)   2D SDfile   Computed 3D by Vconf -m prep SDfile
Find this compound or compounds like it in BindingDB:
Activity Spreadsheet -- Enzyme Inhibition Constant Data from BindingDB
Found 3 hits for monomerid = 50040197
TargetSigma non-opioid intracellular receptor 1(Homo sapiens (Human))
National Institute Of Diabetes And Digestive And Kidney Diseases
Curated by ChEMBL
LigandPNGBDBM50040197(1-(1-Benzo[b]thiophen-2-yl-cycloheptyl)-pyrrolidin...)
Affinity DataKi:  720nM. Assay description: Inhibition of [3H](+)-pentazocine binding to sigma receptor of guinea pig brain homogenates
In DepthDetails ArticlePubMed
TargetSodium-dependent dopamine transporter(Rattus norvegicus (rat))
National Institute Of Diabetes And Digestive And Kidney Diseases
Curated by ChEMBL
LigandPNGBDBM50040197(1-(1-Benzo[b]thiophen-2-yl-cycloheptyl)-pyrrolidin...)
Affinity DataIC50:  52nM. Assay description: Inhibition of [3H]cocaine binding to rat forebrain dopamine receptor
In DepthDetails ArticlePubMed
TargetSodium-dependent dopamine transporter(Rattus norvegicus (rat))
National Institute Of Diabetes And Digestive And Kidney Diseases
Curated by ChEMBL
LigandPNGBDBM50040197(1-(1-Benzo[b]thiophen-2-yl-cycloheptyl)-pyrrolidin...)
Affinity DataIC50:  52nM. Assay description: Inhibition of [3H]cocaine binding to rat forebrain dopamine receptor
In DepthDetails ArticlePubMed