BDBM50040214 CHEMBL3359471
SMILES Cl.COc1cccc(\C=C2/Oc3cc(OCCN4CCCCC4)ccc3C2=O)c1
InChI Key InChIKey=AMTYCQPCZIHCBB-YNYSCKANSA-N
Data  1 IC50
  Tab Delimited (TSV)   2D SDfile   Computed 3D by Vconf -m prep SDfile
Find this compound or compounds like it in BindingDB:
Activity Spreadsheet -- Enzyme Inhibition Constant Data from BindingDB
Found 1 hit for monomerid = 50040214
TargetAcetylcholinesterase(Mus musculus (mouse))
Kyung Hee University
Curated by ChEMBL
LigandPNGBDBM50040214(CHEMBL3359471)
Affinity DataIC50:  1.15E+3nM. Assay description: Inhibition of ICR mouse brain AChE using acetylthiocholine iodide as substrate preincubated for 10 mins before substrate addition by modified Ellman'...
In DepthDetails ArticlePubMed