BDBM50040418 7-[3-(1-Methoxy-1-thiazol-2-yl-propyl)-benzyloxy]-4-phenyl-3H-naphtho[2,3-c]furan-1-one::CHEMBL357335
SMILES CCC(OC)(c1nccs1)c1cccc(COc2ccc3c(c4COC(=O)c4cc3c2)-c2ccccc2)c1
InChI Key InChIKey=NWLWUOCHJFHUIU-UHFFFAOYSA-N
Data  1 IC50
  Tab Delimited (TSV)   2D SDfile   Computed 3D by Vconf -m prep SDfile
Find this compound or compounds like it in BindingDB:
Activity Spreadsheet -- Enzyme Inhibition Constant Data from BindingDB
Found 1 hit for monomerid = 50040418
TargetPolyunsaturated fatty acid 5-lipoxygenase(Homo sapiens (Human))
Merck Frosst Centre For Therapeutic Research
Curated by ChEMBL
LigandPNGBDBM50040418(7-[3-(1-Methoxy-1-thiazol-2-yl-propyl)-benzyloxy]-...)
Affinity DataIC50:  160nM. Assay description: In vitro potency against human 5-Lipoxygenase
In DepthDetails ArticlePubMed