BDBM50040454 CHEMBL3360639
SMILES COc1cc(NC(=O)Cn2ncc3c2c2ccc(C)cc2oc3=O)ccc1Cl
InChI Key InChIKey=HIHQVLBYLPEBEM-UHFFFAOYSA-N
Data  1 IC50
  Tab Delimited (TSV)   2D SDfile   Computed 3D by Vconf -m prep SDfile
Find this compound or compounds like it in BindingDB:
Activity Spreadsheet -- Enzyme Inhibition Constant Data from BindingDB
Found 1 hit for monomerid = 50040454
TargetInosine-5'-monophosphate dehydrogenase(Cryptosporidium parvum)
University Of Houston
Curated by ChEMBL
LigandPNGBDBM50040454(CHEMBL3360639)
Affinity DataIC50:  2.00E+3nM. Assay description: Inhibition of Cryptosporidium parvum IMPDH assessed as reduction in NADH production
In DepthDetails ArticlePubMed