BDBM50040517 (S)-3-{[(S)-2-[(S)-2-(tert-Butoxycarbonyl-methyl-amino)-3-(1H-indol-3-yl)-propionylamino]-6-(3-o-tolyl-ureido)-hexanoyl]-methyl-amino}-N-((S)-1-carbamoyl-2-phenyl-ethyl)-succinamic acid::CHEMBL407507
SMILES CN([C@@H](Cc1c[nH]c2ccccc12)C(=O)N[C@@H](CCCCNC(=O)Nc1ccccc1C)C(=O)N(C)[C@@H](CC(O)=O)C(=O)N[C@@H](Cc1ccccc1)C(N)=O)C(=O)OC(C)(C)C
InChI Key InChIKey=HZKDCDNLUYMXTA-BQYLNSIHSA-N
Data  2 IC50
  Tab Delimited (TSV)   2D SDfile   Computed 3D by Vconf -m prep SDfile
Find this compound or compounds like it in BindingDB:
Activity Spreadsheet -- Enzyme Inhibition Constant Data from BindingDB
Found 2 hits for monomerid = 50040517
TargetGastrin/cholecystokinin type B receptor(Homo sapiens (Human))
Abbott Laboratories
Curated by ChEMBL
LigandPNGBDBM50040517((S)-3-{[(S)-2-[(S)-2-(tert-Butoxycarbonyl-methyl-a...)
Affinity DataIC50: >1.00E+4nM. Assay description: In vitro ability to inhibit [125I]Bolton-Hunter-CCK-8 binding to Cholecystokinin type B receptor in guinea pig cortex
In DepthDetails ArticlePubMed
TargetCholecystokinin receptor type A(Cavia porcellus)
Abbott Laboratories
Curated by ChEMBL
LigandPNGBDBM50040517((S)-3-{[(S)-2-[(S)-2-(tert-Butoxycarbonyl-methyl-a...)
Affinity DataIC50:  707nM. Assay description: In vitro ability to inhibit [125I]Bolton-Hunter-CCK-8 binding to Cholecystokinin type A receptor in guinea pig pancreas
In DepthDetails ArticlePubMed