BDBM50040520 (S)-3-{[(S)-2-[(S)-2-tert-Butoxycarbonylamino-3-(1H-indol-3-yl)-propionylamino]-6-(3-o-tolyl-ureido)-hexanoyl]-methyl-amino}-N-((S)-1-carbamoyl-2-phenyl-ethyl)-N-methyl-succinamic acid::CHEMBL351364
SMILES CN([C@@H](CC(O)=O)C(=O)N(C)[C@@H](Cc1ccccc1)C(N)=O)C(=O)[C@H](CCCCNC(=O)Nc1ccccc1C)NC(=O)[C@H](Cc1c[nH]c2ccccc12)NC(=O)OC(C)(C)C
InChI Key InChIKey=NQWFBQBJSJTMCW-BQYLNSIHSA-N
Data  2 IC50
  Tab Delimited (TSV)   2D SDfile   Computed 3D by Vconf -m prep SDfile
Find this compound or compounds like it in BindingDB:
Activity Spreadsheet -- Enzyme Inhibition Constant Data from BindingDB
Found 2 hits for monomerid = 50040520
TargetGastrin/cholecystokinin type B receptor(Homo sapiens (Human))
Abbott Laboratories
Curated by ChEMBL
LigandPNGBDBM50040520((S)-3-{[(S)-2-[(S)-2-tert-Butoxycarbonylamino-3-(1...)
Affinity DataIC50:  427nM. Assay description: In vitro ability to inhibit [125I]Bolton-Hunter-CCK-8 binding to Cholecystokinin type B receptor in guinea pig cortex
In DepthDetails ArticlePubMed
TargetCholecystokinin receptor type A(Cavia porcellus)
Abbott Laboratories
Curated by ChEMBL
LigandPNGBDBM50040520((S)-3-{[(S)-2-[(S)-2-tert-Butoxycarbonylamino-3-(1...)
Affinity DataIC50:  5.30nM. Assay description: In vitro ability to inhibit [125I]Bolton-Hunter-CCK-8 binding to Cholecystokinin type A receptor in guinea pig pancreas
In DepthDetails ArticlePubMed