BDBM50040524 (S)-N-((S)-1-Carbamoyl-2-phenyl-ethyl)-3-{[(S)-2-[(S)-3-(1H-indol-3-yl)-2-methylamino-propionylamino]-6-(3-o-tolyl-ureido)-hexanoyl]-methyl-amino}-succinamic acid::CHEMBL434674
SMILES CN[C@@H](Cc1c[nH]c2ccccc12)C(=O)N[C@@H](CCCCNC(=O)Nc1ccccc1C)C(=O)N(C)[C@@H](CC(O)=O)C(=O)N[C@@H](Cc1ccccc1)C(N)=O
InChI Key InChIKey=HEURYSWBWQAXDP-CUPIEXAXSA-N
Data  2 IC50
  Tab Delimited (TSV)   2D SDfile   Computed 3D by Vconf -m prep SDfile
Find this compound or compounds like it in BindingDB:
Activity Spreadsheet -- Enzyme Inhibition Constant Data from BindingDB
Found 2 hits for monomerid = 50040524
TargetGastrin/cholecystokinin type B receptor(Homo sapiens (Human))
Abbott Laboratories
Curated by ChEMBL
LigandPNGBDBM50040524((S)-N-((S)-1-Carbamoyl-2-phenyl-ethyl)-3-{[(S)-2-[...)
Affinity DataIC50:  6.92E+4nM. Assay description: In vitro ability to inhibit [125I]Bolton-Hunter-CCK-8 binding to Cholecystokinin type B receptor in guinea pig cortex
In DepthDetails ArticlePubMed
TargetCholecystokinin receptor type A(Cavia porcellus)
Abbott Laboratories
Curated by ChEMBL
LigandPNGBDBM50040524((S)-N-((S)-1-Carbamoyl-2-phenyl-ethyl)-3-{[(S)-2-[...)
Affinity DataIC50:  14nM. Assay description: In vitro ability to inhibit [125I]Bolton-Hunter-CCK-8 binding to Cholecystokinin type A receptor in guinea pig pancreas
In DepthDetails ArticlePubMed