BDBM50040574 1-Benzyl-4-(2-phenyl-oxiranylethynyl)-piperidin-4-ol::CHEMBL349773
SMILES OC1(CCN(Cc2ccccc2)CC1)C#CC1(CO1)c1ccccc1
InChI Key InChIKey=TYZLSJPUXGTVQV-UHFFFAOYSA-N
Data  2 IC50
  Tab Delimited (TSV)   2D SDfile   Computed 3D by Vconf -m prep SDfile
Find this compound or compounds like it in BindingDB:
Activity Spreadsheet -- Enzyme Inhibition Constant Data from BindingDB
Found 2 hits for monomerid = 50040574
TargetGag-Pol polyprotein [489-587](Human immunodeficiency virus type 1)
University Of California
Curated by ChEMBL
LigandPNGBDBM50040574(1-Benzyl-4-(2-phenyl-oxiranylethynyl)-piperidin-4-...)
Affinity DataIC50:  7.25E+5nM. Assay description: In vitro inhibition of recombinant HIV-1 protease expressed in E. coli strain D1210
In DepthDetails ArticlePubMed
TargetGenome polyprotein(Human rhinovirus B)
University Of California
Curated by ChEMBL
LigandPNGBDBM50040574(1-Benzyl-4-(2-phenyl-oxiranylethynyl)-piperidin-4-...)
Affinity DataIC50:  2.50E+5nM. Assay description: In vitro inhibition of recombinant HIV-2 protease expressed in E. coli strain X90
In DepthDetails ArticlePubMed