BDBM50040776 CHEMBL167575::[(4S,7R,13R,19S)-19-Acetylamino-17-benzyl-4-carbamoyl-13-(3-guanidino-propyl)-3,3,14-trimethyl-6,9,12,15,18-pentaoxo-1,2-dithia-5,8,11,14,17-pentaaza-cycloicos-7-yl]-acetic acid
SMILES CN1[C@H](CCCNC(N)=N)C(=O)NCC(=O)N[C@H](CC(O)=O)C(=O)N[C@@H](C(N)=O)C(C)(C)SSC[C@@H](NC(C)=O)C(=O)N(Cc2ccccc2)CC1=O
InChI Key InChIKey=KHEPTFKEYMTFHE-BILGYAHESA-N
Data  1 KI
  Tab Delimited (TSV)   2D SDfile   Computed 3D by Vconf -m prep SDfile
Find this compound or compounds like it in BindingDB:
Activity Spreadsheet -- Enzyme Inhibition Constant Data from BindingDB
Found 1 hit for monomerid = 50040776
TargetIntegrin alpha-IIb/beta-3(Homo sapiens (Human))
Smithkline Beecham Pharmaceuticals Research And Development
Curated by ChEMBL
LigandPNGBDBM50040776(CHEMBL167575 | [(4S,7R,13R,19S)-19-Acetylamino-17-...)
Affinity DataKi:  430nM. Assay description: Tested for inhibition of fibrinogen binding to purified GPIIb/IIIa isolated from human platelets and reconstituted in liposomes
In DepthDetails ArticlePubMed