BDBM50040823 11-(2,6-Diisopropyl-phenylcarbamoyl)-6,11-dihydro-dibenzo[b,e]oxepine-2-carboxylic acid methyl ester::CHEMBL167198
SMILES COC(=O)c1ccc2OCc3ccccc3C(C(=O)Nc3c(cccc3C(C)C)C(C)C)c2c1
InChI Key InChIKey=CCKPSQMDQXIBOG-UHFFFAOYSA-N
Data  1 IC50
  Tab Delimited (TSV)   2D SDfile   Computed 3D by Vconf -m prep SDfile
Find this compound or compounds like it in BindingDB:
Activity Spreadsheet -- Enzyme Inhibition Constant Data from BindingDB
Found 1 hit for monomerid = 50040823
TargetAcyl-CoA:cholesterol acyltransferase(Oryctolagus cuniculus)
Kyowa Hakko Kogyo
Curated by ChEMBL
LigandPNGBDBM50040823(11-(2,6-Diisopropyl-phenylcarbamoyl)-6,11-dihydro-...)
Affinity DataIC50:  180nM. Assay description: In vitro inhibitory activity against acyl coenzyme A:cholesterol acyltransferase in liver microsomes isolated from cholesterol-fed rabbits
In DepthDetails ArticlePubMed