BDBM50040830 2-Bromo-6,11-dihydro-dibenzo[b,e]oxepine-11-carboxylic acid (2,6-diisopropyl-phenyl)-amide::CHEMBL166556
SMILES CC(C)c1cccc(C(C)C)c1NC(=O)C1c2ccccc2COc2ccc(Br)cc12
InChI Key InChIKey=AJLGIHBSQSODDV-UHFFFAOYSA-N
Data  1 IC50
  Tab Delimited (TSV)   2D SDfile   Computed 3D by Vconf -m prep SDfile
Find this compound or compounds like it in BindingDB:
Activity Spreadsheet -- Enzyme Inhibition Constant Data from BindingDB
Found 1 hit for monomerid = 50040830
TargetAcyl-CoA:cholesterol acyltransferase(Oryctolagus cuniculus)
Kyowa Hakko Kogyo
Curated by ChEMBL
LigandPNGBDBM50040830(2-Bromo-6,11-dihydro-dibenzo[b,e]oxepine-11-carbox...)
Affinity DataIC50:  23nM. Assay description: In vitro inhibitory activity against acyl coenzyme A:cholesterol acyltransferase in liver microsomes isolated from cholesterol-fed rabbits
In DepthDetails ArticlePubMed