BDBM50041037 (4S,6R)-4-Ethylamino-7,7-dioxo-6-propyl-4,5,6,7-tetrahydro-7lambda*6*-thieno[2,3-b]thiopyran-2-sulfonic acid amide::CHEMBL415964
SMILES CCC[C@@H]1C[C@H](NCC)c2cc(sc2S1(=O)=O)S(N)(=O)=O
InChI Key InChIKey=BGHZCMPGDRVLBO-SCZZXKLOSA-N
Data  1 KI
  Tab Delimited (TSV)   2D SDfile   Computed 3D by Vconf -m prep SDfile
Find this compound or compounds like it in BindingDB:
Activity Spreadsheet -- Enzyme Inhibition Constant Data from BindingDB
Found 1 hit for monomerid = 50041037
TargetCarbonic anhydrase 2(Homo sapiens (Human))
Abbott Laboratories
Curated by ChEMBL
LigandPNGBDBM50041037((4S,6R)-4-Ethylamino-7,7-dioxo-6-propyl-4,5,6,7-te...)
Affinity DataKi:  0.170nM. Assay description: Compound was evaluated for the inhibitory constant towards Human Carbonic anhydrase II (HCA II)
In DepthDetails ArticlePubMed