BDBM50041172 2-{2-[1-(4-Chloro-benzyl)-4-methyl-6-(5-phenyl-pyridin-2-ylmethoxy)-4,5-dihydro-1H-thiopyrano[2,3,4-cd]indol-2-yl]-ethylamino}-propionic acid::CHEMBL16574
SMILES CC(NCCc1c2SC(C)Cc3c(OCc4ccc(cn4)-c4ccccc4)ccc(n1Cc1ccc(Cl)cc1)c23)C(O)=O
InChI Key InChIKey=GSRYYWPJQBXTMV-UHFFFAOYSA-N
Data  1 IC50
  Tab Delimited (TSV)   2D SDfile   Computed 3D by Vconf -m prep SDfile
Find this compound or compounds like it in BindingDB:
Activity Spreadsheet -- Enzyme Inhibition Constant Data from BindingDB
Found 1 hit for monomerid = 50041172
TargetPolyunsaturated fatty acid 5-lipoxygenase(Homo sapiens (Human))
Merck Frosst Centre For Therapeutic Research
Curated by ChEMBL
LigandPNGBDBM50041172(2-{2-[1-(4-Chloro-benzyl)-4-methyl-6-(5-phenyl-pyr...)
Affinity DataIC50:  4.00E+3nM. Assay description: In vitro inhibition of human 5-Lipoxygenase.
In DepthDetails ArticlePubMed