BDBM50041177 5-((3,4,5-trichlorophenylamino)methyl)furo[2,3-d]pyrimidine-2,4-diamine::5-[(3,4,5-Trichloro-phenylamino)-methyl]-furo[2,3-d]pyrimidine-2,4-diamine::CHEMBL17235
SMILES Nc1nc(N)c2c(CNc3cc(Cl)c(Cl)c(Cl)c3)coc2n1
InChI Key InChIKey=UECLOOWSSNULBP-UHFFFAOYSA-N
Data  7 IC50
  Tab Delimited (TSV)   2D SDfile   Computed 3D by Vconf -m prep SDfile
Find this compound or compounds like it in BindingDB:
Activity Spreadsheet -- Enzyme Inhibition Constant Data from BindingDB
Found 7 hits for monomerid = 50041177
TargetDihydrofolate reductase(Lactobacillus casei)
Duquesne University
Curated by ChEMBL
LigandPNGBDBM50041177(5-((3,4,5-trichlorophenylamino)methyl)furo[2,3-d]p...)
Affinity DataIC50: >2.50E+4nM. Assay description: Inhibitory concentration of the compound for DHFR in Lactobacillus casei
In DepthDetails ArticlePubMed
TargetBifunctional dihydrofolate reductase-thymidylate synthase(Toxoplasma gondii)
Duquesne University
Curated by ChEMBL
LigandPNGBDBM50041177(5-((3,4,5-trichlorophenylamino)methyl)furo[2,3-d]p...)
Affinity DataIC50: >3.90E+3nM. Assay description: Inhibitory concentration of the compound for DHFR in Toxoplasma gondii
In DepthDetails ArticlePubMed
TargetDihydrofolate reductase(Homo sapiens (Human))
Duquesne University
Curated by ChEMBL
LigandPNGBDBM50041177(5-((3,4,5-trichlorophenylamino)methyl)furo[2,3-d]p...)
Affinity DataIC50: >2.50E+4nM. Assay description: Inhibitory concentration of the compound for DHFR in recombinant human
In DepthDetails ArticlePubMed
TargetBifunctional dihydrofolate reductase-thymidylate synthase(Toxoplasma gondii)
Duquesne University
Curated by ChEMBL
LigandPNGBDBM50041177(5-((3,4,5-trichlorophenylamino)methyl)furo[2,3-d]p...)
Affinity DataIC50: >3.90E+3nM. Assay description: Inhibition of Toxoplasma gondii DHFR by spectrophotometric assay
In DepthDetails ArticlePubMed
TargetDihydrofolate reductase(Rattus norvegicus (rat))
Duquesne University
Curated by ChEMBL
LigandPNGBDBM50041177(5-((3,4,5-trichlorophenylamino)methyl)furo[2,3-d]p...)
Affinity DataIC50:  2.56E+4nM. Assay description: Inhibitory concentration of the compound for DHFR in rat liver
In DepthDetails ArticlePubMed
TargetDihydrofolate reductase(Rattus norvegicus (rat))
Duquesne University
Curated by ChEMBL
LigandPNGBDBM50041177(5-((3,4,5-trichlorophenylamino)methyl)furo[2,3-d]p...)
Affinity DataIC50:  2.56E+4nM. Assay description: Inhibition of rat liver DHFR by spectrophotometric assay
In DepthDetails ArticlePubMed
TargetDihydrofolate reductase(Pneumocystis carinii)
Duquesne University
Curated by ChEMBL
LigandPNGBDBM50041177(5-((3,4,5-trichlorophenylamino)methyl)furo[2,3-d]p...)
Affinity DataIC50:  8.30E+3nM. Assay description: Inhibitory concentration of the compound for DHFR in Pneumocystis carinii
In DepthDetails ArticlePubMed