BDBM50041226 3-(5-Carbamimidoyl-benzofuran-2-yl)-2-[4-((S)-pyrrolidin-3-yloxy)-phenyl]-propionic acid::CHEMBL280157
SMILES NC(=N)c1ccc2oc(CC(C(O)=O)c3ccc(O[C@H]4CCNC4)cc3)cc2c1
InChI Key InChIKey=BUZIFYFUSBPIJE-KKFHFHRHSA-N
Data  2 IC50
  Tab Delimited (TSV)   2D SDfile   Computed 3D by Vconf -m prep SDfile
Find this compound or compounds like it in BindingDB:
Activity Spreadsheet -- Enzyme Inhibition Constant Data from BindingDB
Found 2 hits for monomerid = 50041226
TargetCoagulation factor X(Homo sapiens (Human))
Daiichi Pharmaceutical
Curated by ChEMBL
LigandPNGBDBM50041226(3-(5-Carbamimidoyl-benzofuran-2-yl)-2-[4-((S)-pyrr...)
Affinity DataIC50:  1.50E+3nM. Assay description: In vitro evaluation for the concentration needed for inhibiting factor Xa by 50%
In DepthDetails ArticlePubMed
TargetProthrombin(Homo sapiens (Human))
Daiichi Pharmaceutical
Curated by ChEMBL
LigandPNGBDBM50041226(3-(5-Carbamimidoyl-benzofuran-2-yl)-2-[4-((S)-pyrr...)
Affinity DataIC50:  2.30E+5nM. Assay description: In vitro evaluation for the concentration needed for inhibiting thrombin by 50%
In DepthDetails ArticlePubMed