BDBM50041237 ((R)-1-Methyl-2-phenyl-ethyl)-(5-phenyl-pentyl)-amine::CHEMBL280160
SMILES C[C@H](Cc1ccccc1)NCCCCCc1ccccc1
InChI Key InChIKey=HJSNGVRGYKYSOZ-GOSISDBHSA-N
Data  2 KI
  Tab Delimited (TSV)   2D SDfile   Computed 3D by Vconf -m prep SDfile
Find this compound or compounds like it in BindingDB:
Activity Spreadsheet -- Enzyme Inhibition Constant Data from BindingDB
Found 2 hits for monomerid = 50041237
TargetSigma non-opioid intracellular receptor 1(Cavia porcellus (Guinea pig))
Virginia Commonwealth University
Curated by ChEMBL
LigandPNGBDBM50041237(((R)-1-Methyl-2-phenyl-ethyl)-(5-phenyl-pentyl)-am...)
Affinity DataKi:  0.5nM. Assay description: Displacement of (+)-[3H]pentazocine from guinea pig brain membrane sigma1 receptor by scintillation spectrometric method
In DepthDetails ArticlePubMed
TargetSigma non-opioid intracellular receptor 1(Homo sapiens (Human))
Virginia Commonwealth University
Curated by ChEMBL
LigandPNGBDBM50041237(((R)-1-Methyl-2-phenyl-ethyl)-(5-phenyl-pentyl)-am...)
Affinity DataKi:  0.900nM. Assay description: Binding affinity against sigma-1 receptor of guinea pig brain membranes using [3H]-pentazocine as radioligand
In DepthDetails ArticlePubMed