BDBM50041281 (3S,8R)-3-Phenyl-8-aza-bicyclo[3.2.1]octane-2-carboxylic acid methyl ester::CHEMBL279657
SMILES COC(=O)C1C2CCC(C[C@@H]1c1ccccc1)N2
InChI Key InChIKey=JEZUFWYDKGYUCS-DBBXXEFVSA-N
Data  3 IC50
  Tab Delimited (TSV)   2D SDfile   Computed 3D by Vconf -m prep SDfile
Find this compound or compounds like it in BindingDB:
Activity Spreadsheet -- Enzyme Inhibition Constant Data from BindingDB
Found 3 hits for monomerid = 50041281
TargetTransporter(Rattus norvegicus)
National Institute On Drug Abuse
Curated by ChEMBL
LigandPNGBDBM50041281((3S,8R)-3-Phenyl-8-aza-bicyclo[3.2.1]octane-2-carb...)
Affinity DataIC50:  85nM. Assay description: Inhibition of [3H]nisoxetine binding to norepinephrine (NE) transporter
In DepthDetails ArticlePubMed
TargetSodium-dependent dopamine transporter(Rattus norvegicus (rat))
National Institute On Drug Abuse
Curated by ChEMBL
LigandPNGBDBM50041281((3S,8R)-3-Phenyl-8-aza-bicyclo[3.2.1]octane-2-carb...)
Affinity DataIC50:  31nM. Assay description: Inhibition of [3H]WIN-35428 binding to dopamine (DA) transporter
In DepthDetails ArticlePubMed
TargetSodium-dependent serotonin transporter(Rattus norvegicus (rat))
National Institute On Drug Abuse
Curated by ChEMBL
LigandPNGBDBM50041281((3S,8R)-3-Phenyl-8-aza-bicyclo[3.2.1]octane-2-carb...)
Affinity DataIC50:  156nM. Assay description: Inhibition of [3H]paroxetine binding to 5-hydroxytryptamine (5-HT) transporter
In DepthDetails ArticlePubMed