BDBM50041539 CHEMBL3358400
SMILES CN1CCN(CC1)c1ccc(Nc2cc(cn(C)c2=O)-c2cccc(c2CO)-n2ccc3nc(ccc3c2=O)C2CC2)nc1
InChI Key InChIKey=QPIVVOHSEVHIRG-UHFFFAOYSA-N
Data  2 IC50
  Tab Delimited (TSV)   2D SDfile   Computed 3D by Vconf -m prep SDfile
Find this compound or compounds like it in BindingDB:
Activity Spreadsheet -- Enzyme Inhibition Constant Data from BindingDB
Found 2 hits for monomerid = 50041539
TargetTyrosine-protein kinase BTK(Homo sapiens (Human))
China Pharmaceutical University
Curated by ChEMBL
LigandPNGBDBM50041539(CHEMBL3358400)
Affinity DataIC50:  564nM. Assay description: Inhibition of BTK (unknown origin) using biotin-labeled peptide substrate incubated for 1 hr by TR-FRET based HTRF kinase assay
In DepthDetails ArticlePubMed
TargetTyrosine-protein kinase BTK(Homo sapiens (Human))
China Pharmaceutical University
Curated by ChEMBL
LigandPNGBDBM50041539(CHEMBL3358400)
Affinity DataIC50:  3.25E+3nM. Assay description: Inhibition of BTK in human Ramos cells assessed as reduction in IgM-induced calcium influx incubated for 20 mins by Fluo-4 dye based fluorescence ass...
In DepthDetails ArticlePubMed