BDBM50041648 CHEMBL430937::[1-[(S)-1-{(S)-2-[(1-Carbamoyl-2-phenyl-ethylcarbamoyl)-methyl]-pyrrolidine-1-carbonyl}-5-(3-o-tolyl-ureido)-pentylcarbamoyl]-2-(1H-indol-3-yl)-ethyl]-carbamic acid tert-butyl ester
SMILES Cc1ccccc1NC(=O)NCCCC[C@H](NC(=O)C(Cc1c[nH]c2ccccc12)NC(=O)OC(C)(C)C)C(=O)N1CCC[C@H]1CC(=O)NC(Cc1ccccc1)C(N)=O
InChI Key InChIKey=KWFOXALTHATCKF-PKBTWFAQSA-N
Data  1 IC50
  Tab Delimited (TSV)   2D SDfile   Computed 3D by Vconf -m prep SDfile
Find this compound or compounds like it in BindingDB:
Activity Spreadsheet -- Enzyme Inhibition Constant Data from BindingDB
Found 1 hit for monomerid = 50041648
TargetCholecystokinin receptor type A(Cavia porcellus)
Abbott Laboratories
Curated by ChEMBL
LigandPNGBDBM50041648(CHEMBL430937 | [1-[(S)-1-{(S)-2-[(1-Carbamoyl-2-ph...)
Affinity DataIC50:  239nM. Assay description: Concentration that inhibited 50% of specific binding of [125I]-Bolton-Hunter CCK-8 binding in guinea pig pancreas
In DepthDetails ArticlePubMed