BDBM50041682 CHEMBL3358895
SMILES C[C@H](N1C[C@@H](C)[C@@H](CN(C)C(=O)Nc2ccccc2)Oc2c(NS(=O)(=O)c3ccc(F)cc3)cccc2C1=O)C(O)=O
InChI Key InChIKey=SBQXYNDPRONOQV-HHJKRLRDSA-N
Data  1 IC50
  Tab Delimited (TSV)   2D SDfile   Computed 3D by Vconf -m prep SDfile
Find this compound or compounds like it in BindingDB:
Activity Spreadsheet -- Enzyme Inhibition Constant Data from BindingDB
Found 1 hit for monomerid = 50041682
TargetInduced myeloid leukemia cell differentiation protein Mcl-1(Homo sapiens (Human))
Institute
Curated by ChEMBL
LigandPNGBDBM50041682(CHEMBL3358895)
Affinity DataIC50: >5.00E+4nM. Assay description: Binding affinity to human MCL1 (173 to 329 aa) using TAMRA-labeled Noxa peptide preincubated for 30 mins by fluorescent polarization assay
In DepthDetails ArticlePubMed