BDBM50041689 5-Benzyl-2-butyl-3-[2'-(1H-tetrazol-5-yl)-biphenyl-4-ylmethyl]-3,5-dihydro-imidazo[4,5-c]pyridin-4-one::CHEMBL42397
SMILES CCCCc1nc2ccn(Cc3ccccc3)c(=O)c2n1Cc1ccc(cc1)-c1ccccc1-c1nnn[nH]1
InChI Key InChIKey=ABXPQQANEFDOLU-UHFFFAOYSA-N
Data  2 IC50
  Tab Delimited (TSV)   2D SDfile   Computed 3D by Vconf -m prep SDfile
Find this compound or compounds like it in BindingDB:
Activity Spreadsheet -- Enzyme Inhibition Constant Data from BindingDB
Found 2 hits for monomerid = 50041689
LigandPNGBDBM50041689(5-Benzyl-2-butyl-3-[2'-(1H-tetrazol-5-yl)-biphenyl...)
Affinity DataIC50:  5.89E+8nM. Assay description: Antagonist activity at AT1 receptor in Rattus norvegicus (rat) adrenal cortex membrane
In DepthDetails Article
TargetType-1 angiotensin II receptor B(RAT)
E. Merck
Curated by ChEMBL
LigandPNGBDBM50041689(5-Benzyl-2-butyl-3-[2'-(1H-tetrazol-5-yl)-biphenyl...)
Affinity DataIC50:  1.70nM. Assay description: Binding affinity against AT1 receptor of rat adrenal cortical membranes
In DepthDetails ArticlePubMed