BDBM50041709 4-{1-[(E)-Hydroxyimino]-heptyl}-thiophene-2-sulfonic acid amide::CHEMBL42425
SMILES CCCCCCC(N=O)c1csc(c1)S(N)(=O)=O
InChI Key InChIKey=HWBHCBDYLZOWNO-UHFFFAOYSA-N
Data  1 IC50
  Tab Delimited (TSV)   2D SDfile   Computed 3D by Vconf -m prep SDfile
Find this compound or compounds like it in BindingDB:
Activity Spreadsheet -- Enzyme Inhibition Constant Data from BindingDB
Found 1 hit for monomerid = 50041709
TargetCarbonic anhydrase 2(Homo sapiens (Human))
Allergan
Curated by ChEMBL
LigandPNGBDBM50041709(4-{1-[(E)-Hydroxyimino]-heptyl}-thiophene-2-sulfon...)
Affinity DataIC50:  5.80nM. Assay description: Activity against human carbonic anhydrase II
In DepthDetails ArticlePubMed