BDBM50041712 4-(1-Amino-pentyl)-thiophene-2-sulfonic acid amide::CHEMBL42080
SMILES CCCCC(N)c1csc(c1)S(N)(=O)=O
InChI Key InChIKey=MBEQHZLHLIYHMF-UHFFFAOYSA-N
Data  1 IC50
  Tab Delimited (TSV)   2D SDfile   Computed 3D by Vconf -m prep SDfile
Find this compound or compounds like it in BindingDB:
Activity Spreadsheet -- Enzyme Inhibition Constant Data from BindingDB
Found 1 hit for monomerid = 50041712
TargetCarbonic anhydrase 2(Homo sapiens (Human))
Allergan
Curated by ChEMBL
LigandPNGBDBM50041712(4-(1-Amino-pentyl)-thiophene-2-sulfonic acid amide...)
Affinity DataIC50:  626nM. Assay description: Activity against human carbonic anhydrase II
In DepthDetails ArticlePubMed