BDBM50041778 2-(1,8-Dihydroxy-9-oxo-9,10-dihydro-anthracen-2-ylmethyl)-benzoic acid::CHEMBL291181
SMILES OC(=O)c1ccccc1Cc1ccc2Cc3cccc(O)c3C(=O)c2c1O
InChI Key InChIKey=TZKQXJLKEYYSPA-UHFFFAOYSA-N
Data  1 IC50
  Tab Delimited (TSV)   2D SDfile   Computed 3D by Vconf -m prep SDfile
Find this compound or compounds like it in BindingDB:
Activity Spreadsheet -- Enzyme Inhibition Constant Data from BindingDB
Found 1 hit for monomerid = 50041778
Target5-lipoxygenase(Bos taurus)
UniversitäT Regensburg
Curated by ChEMBL
LigandPNGBDBM50041778(2-(1,8-Dihydroxy-9-oxo-9,10-dihydro-anthracen-2-yl...)
Affinity DataIC50:  4.00E+3nM. Assay description: Inhibition of 5-lipoxygenase in bovine polymorphonuclear leukocytes
In DepthDetails ArticlePubMed