BDBM50041779 1,8-Dihydroxy-3-(4-methoxy-benzyl)-10H-anthracen-9-one::CHEMBL44061
SMILES COc1ccc(Cc2cc(O)c3C(=O)c4c(O)cccc4Cc3c2)cc1
InChI Key InChIKey=GEIDJIHUDFKLLH-UHFFFAOYSA-N
Data  1 IC50
  Tab Delimited (TSV)   2D SDfile   Computed 3D by Vconf -m prep SDfile
Find this compound or compounds like it in BindingDB:
Activity Spreadsheet -- Enzyme Inhibition Constant Data from BindingDB
Found 1 hit for monomerid = 50041779
Target5-lipoxygenase(Bos taurus)
UniversitäT Regensburg
Curated by ChEMBL
LigandPNGBDBM50041779(1,8-Dihydroxy-3-(4-methoxy-benzyl)-10H-anthracen-9...)
Affinity DataIC50: >3.00E+4nM. Assay description: Inhibition of 5-lipoxygenase in bovine polymorphonuclear leukocytes
In DepthDetails ArticlePubMed