BDBM50041794 1,8-Dihydroxy-3-(4-methoxy-benzoyl)-10H-anthracen-9-one::CHEMBL45104
SMILES COc1ccc(cc1)C(=O)c1cc(O)c2C(=O)c3c(O)cccc3Cc2c1
InChI Key InChIKey=ONBOREVUWXZLHK-UHFFFAOYSA-N
Data  1 IC50
  Tab Delimited (TSV)   2D SDfile   Computed 3D by Vconf -m prep SDfile
Find this compound or compounds like it in BindingDB:
Activity Spreadsheet -- Enzyme Inhibition Constant Data from BindingDB
Found 1 hit for monomerid = 50041794
Target5-lipoxygenase(Bos taurus)
UniversitäT Regensburg
Curated by ChEMBL
LigandPNGBDBM50041794(1,8-Dihydroxy-3-(4-methoxy-benzoyl)-10H-anthracen-...)
Affinity DataIC50: >3.00E+4nM. Assay description: Inhibition of 5-lipoxygenase in bovine polymorphonuclear leukocytes
In DepthDetails ArticlePubMed