BDBM50041901 2-substituted NECA derivatives, 2::5-[6-Amino-2-(5-cyano-pent-1-ynyl)-purin-9-yl]-3,4-dihydroxy-tetrahydro-furan-2-carboxylic acid ethylamide
SMILES CCNC(=O)C1OC(C(O)C1O)n1cnc2c(N)nc(nc12)C#CCCCC#N
InChI Key InChIKey=DYUTVMYUMCFDOY-UHFFFAOYSA-N
Data  3 KI
  Tab Delimited (TSV)   2D SDfile   Computed 3D by Vconf -m prep SDfile
Find this compound or compounds like it in BindingDB:
Activity Spreadsheet -- Enzyme Inhibition Constant Data from BindingDB
Found 3 hits for monomerid = 50041901
TargetAdenosine receptor A3(Homo sapiens (Human))
Universitat Wurzburg
Curated by PDSP Ki Database
LigandPNGBDBM50041901(2-substituted NECA derivatives, 2 | 5-[6-Amino-2-(...)
Affinity DataKi:  4.70nM
In DepthDetails ArticlePubMed
TargetAdenosine receptor A2a(Homo sapiens (Human))
Universitat Wurzburg
Curated by PDSP Ki Database
LigandPNGBDBM50041901(2-substituted NECA derivatives, 2 | 5-[6-Amino-2-(...)
Affinity DataKi:  25nM
In DepthDetails ArticlePubMed
TargetAdenosine receptor A1(Homo sapiens (Human))
Universitat Wurzburg
Curated by PDSP Ki Database
LigandPNGBDBM50041901(2-substituted NECA derivatives, 2 | 5-[6-Amino-2-(...)
Affinity DataKi:  38nM
In DepthDetails ArticlePubMed