BDBM50041993 CHEMBL3359544
SMILES Cl.COc1ccc(NC(=O)c2ccc(C)c(O)c2NC(=O)c2ccc(cc2)N2CCCN(C)CC2)cc1
InChI Key InChIKey=OAEKHWSNFVSYJR-UHFFFAOYSA-N
Data  1 IC50
  Tab Delimited (TSV)   2D SDfile   Computed 3D by Vconf -m prep SDfile
Find this compound or compounds like it in BindingDB:
Activity Spreadsheet -- Enzyme Inhibition Constant Data from BindingDB
Found 1 hit for monomerid = 50041993
TargetCoagulation factor X(Homo sapiens (Human))
Astellas Pharma
Curated by ChEMBL
LigandPNGBDBM50041993(CHEMBL3359544)
Affinity DataIC50:  61nM. Assay description: Inhibition of human factor 10a using S-2222 chromogenic substrate assessed as hydrolysis by microplate reader
In DepthDetails ArticlePubMed