BDBM50042107 1-(2,6-Diisopropyl-phenyl)-3-(1,1-dimethyl-2-phenyl-ethyl)-urea::CHEMBL109666
SMILES CC(C)c1cccc(C(C)C)c1NC(=O)NC(C)(C)Cc1ccccc1
InChI Key InChIKey=LRRLQBFDVCZENL-UHFFFAOYSA-N
Data  1 IC50
  Tab Delimited (TSV)   2D SDfile   Computed 3D by Vconf -m prep SDfile
Find this compound or compounds like it in BindingDB:
Activity Spreadsheet -- Enzyme Inhibition Constant Data from BindingDB
Found 1 hit for monomerid = 50042107
TargetAcyl-CoA:cholesterol acyltransferase(Oryctolagus cuniculus)
Warner-Lambert
Curated by ChEMBL
LigandPNGBDBM50042107(1-(2,6-Diisopropyl-phenyl)-3-(1,1-dimethyl-2-pheny...)
Affinity DataIC50:  77nM. Assay description: In vitro inhibition of Acyl coenzyme A:cholesterol acyltransferase using intestinal microsomes isolated from cholesterol fed rabbits
In DepthDetails ArticlePubMed