BDBM50042234 4'-(2-Butyl-4-oxo-1,3-diaza-spiro[4.4]non-1-en-3-ylmethyl)-biphenyl-2-carboxylic acid::CHEMBL439968
SMILES CCCCC1=NC2(CCCC2)C(=O)N1Cc1ccc(cc1)-c1ccccc1C(O)=O
InChI Key InChIKey=GJBPPMVTBDRYFK-UHFFFAOYSA-N
Data  2 IC50  1 EC50
  Tab Delimited (TSV)   2D SDfile   Computed 3D by Vconf -m prep SDfile
Find this compound or compounds like it in BindingDB:
Activity Spreadsheet -- Enzyme Inhibition Constant Data from BindingDB
Found 3 hits for monomerid = 50042234
TargetType-1 angiotensin II receptor B(RAT)
Sanofi Recherche
Curated by ChEMBL
LigandPNGBDBM50042234(4'-(2-Butyl-4-oxo-1,3-diaza-spiro[4.4]non-1-en-3-y...)
Affinity DataIC50:  10nM. Assay description: Binding affinity for Angiotensin II receptor, type 1 measured by ability to displace [125I]- A II from its specific binding site in rat liver membran...
In DepthDetails ArticlePubMed
TargetType-1 angiotensin II receptor(Homo sapiens (Human))
Fraunhofer Institute For Translational Medicine And Phamacology Itmp
Curated by ChEMBL
LigandPNGBDBM50042234(4'-(2-Butyl-4-oxo-1,3-diaza-spiro[4.4]non-1-en-3-y...)
Affinity DataIC50:  190nM. Assay description: Antagonist activity at human AT1 overexpressed in CHO-K1 cells in presence of 10 nM [Val5-angiotensin II measured after 90 mins by HTRF based IP-one ...
In DepthDetails ArticlePubMed
TargetLeukotriene B4 receptor 2(Homo sapiens (Human))
Fraunhofer Institute For Translational Medicine And Phamacology Itmp
Curated by ChEMBL
LigandPNGBDBM50042234(4'-(2-Butyl-4-oxo-1,3-diaza-spiro[4.4]non-1-en-3-y...)
Affinity DataEC50:  1.49E+3nM. Assay description: Agonist activity at human BLT2 overexpressed in CHO-K1 cells assessed as accumulation of inositol monophosphate measured after 90 mins by HTRF assay
In DepthDetails ArticlePubMed