BDBM50042260 1-[4'-(2-Butyl-1,3-diaza-spiro[4.4]non-1-en-3-ylmethyl)-biphenyl-2-yl]-2,2-dimethyl-propan-1-one::CHEMBL326049
SMILES CCCCC1=NC2(CCCC2)CN1Cc1ccc(cc1)-c1ccccc1C(=O)C(C)(C)C
InChI Key InChIKey=DYURUOUOBVIGCU-UHFFFAOYSA-N
Data  1 IC50
  Tab Delimited (TSV)   2D SDfile   Computed 3D by Vconf -m prep SDfile
Find this compound or compounds like it in BindingDB:
Activity Spreadsheet -- Enzyme Inhibition Constant Data from BindingDB
Found 1 hit for monomerid = 50042260
TargetType-1 angiotensin II receptor B(RAT)
Sanofi Recherche
Curated by ChEMBL
LigandPNGBDBM50042260(1-[4'-(2-Butyl-1,3-diaza-spiro[4.4]non-1-en-3-ylme...)
Affinity DataIC50: >1.00E+4nM. Assay description: Binding affinity for Angiotensin II receptor, type 1 measured by ability to displace [125I]- A II from its specific binding site in rat liver membran...
In DepthDetails ArticlePubMed