BDBM50042340 CHEMBL114433::Trifluoro-methanesulfonic acid 7-dipropylamino-5,6,7,8-tetrahydro-naphthalen-2-yl ester
SMILES CCCN(CCC)C1CCc2ccc(OS(=O)(=O)C(F)(F)F)cc2C1
InChI Key InChIKey=JVSIKYVCSMXDOZ-UHFFFAOYSA-N
Data  3 KI
  Tab Delimited (TSV)   2D SDfile   Computed 3D by Vconf -m prep SDfile
Find this compound or compounds like it in BindingDB:
Activity Spreadsheet -- Enzyme Inhibition Constant Data from BindingDB
Found 3 hits for monomerid = 50042340
TargetD(2) dopamine receptor(Rattus norvegicus (rat))
Medicinaregatan
Curated by ChEMBL
LigandPNGBDBM50042340(CHEMBL114433 | Trifluoro-methanesulfonic acid 7-di...)
Affinity DataKi:  150nM. Assay description: Binding affinity against dopamine receptor D2 in homogenated rat brain tissue, using by ([3H]N00437) as radioligand
In DepthDetails ArticlePubMed
Target5-hydroxytryptamine receptor 1A(Rattus norvegicus (rat))
Medicinaregatan
Curated by ChEMBL
LigandPNGBDBM50042340(CHEMBL114433 | Trifluoro-methanesulfonic acid 7-di...)
Affinity DataKi:  360nM. Assay description: Binding affinity against 5-hydroxytryptamine 1A receptor in homogenated rat brain tissue, using by [3H]8-OH-DPAT as radioligand
In DepthDetails ArticlePubMed
TargetD(2) dopamine receptor(Rattus norvegicus (rat))
Medicinaregatan
Curated by ChEMBL
LigandPNGBDBM50042340(CHEMBL114433 | Trifluoro-methanesulfonic acid 7-di...)
Affinity DataKi:  1.30E+3nM. Assay description: Binding affinity against dopamine receptor D2 in rat brain tissue using [3H]spiperone
In DepthDetails ArticlePubMed