BDBM50042583 CHEMBL3353271
SMILES COc1cc(ccc1C)C12N(CCN1C(=O)c1ccccc21)C(=O)c1ccc(F)c(F)c1
InChI Key InChIKey=QAGGNPYLFUGTSS-UHFFFAOYSA-N
Data  1 IC50
  Tab Delimited (TSV)   2D SDfile   Computed 3D by Vconf -m prep SDfile
Find this compound or compounds like it in BindingDB:
Activity Spreadsheet -- Enzyme Inhibition Constant Data from BindingDB
Found 1 hit for monomerid = 50042583
TargetMuscarinic acetylcholine receptor M5(Homo sapiens (Human))
Vanderbilt University Medical Center
Curated by ChEMBL
LigandPNGBDBM50042583(CHEMBL3353271)
Affinity DataIC50:  1.30E+3nM. Assay description: Negative allosteric modulation of human muscarinic acetylcholine receptor M5 expressed in CHO cells assessed as inhibition of acetylcholine-induced c...
In DepthDetails ArticlePubMed