BDBM50042656 7-[2,3-Bis-(4-fluoro-phenyl)-5-isopropyl-pyrrol-1-yl]-3,5-dihydroxy-hept-6-enoic acid methyl ester::CHEMBL333642
SMILES COC(=O)C[C@H](O)C[C@H](O)\C=C\n1c(cc(c1-c1ccc(F)cc1)-c1ccc(F)cc1)C(C)C
InChI Key InChIKey=WCGVTMHGMJNURR-GOHHFNLLSA-N
Data  1 IC50
  Tab Delimited (TSV)   2D SDfile   Computed 3D by Vconf -m prep SDfile
Find this compound or compounds like it in BindingDB:
Activity Spreadsheet -- Enzyme Inhibition Constant Data from BindingDB
Found 1 hit for monomerid = 50042656
Target3-hydroxy-3-methylglutaryl-coenzyme A reductase(Rattus norvegicus (rat))
Glaxo Group Research
Curated by ChEMBL
LigandPNGBDBM50042656(7-[2,3-Bis-(4-fluoro-phenyl)-5-isopropyl-pyrrol-1-...)
Affinity DataIC50:  2nM. Assay description: Inhibition of rat liver microsomal HMG-CoA reductase
In DepthDetails ArticlePubMed