BDBM50042697 CHEMBL3353878
SMILES CC(C)(C)c1cc(NC(=O)[C@@H]2C[C@@H](O)CN2C2CCCCC2)on1
InChI Key InChIKey=WGWKTQCAJSRICS-KGLIPLIRSA-N
Data  2 EC50
  Tab Delimited (TSV)   2D SDfile   Computed 3D by Vconf -m prep SDfile
Find this compound or compounds like it in BindingDB:
Activity Spreadsheet -- Enzyme Inhibition Constant Data from BindingDB
Found 2 hits for monomerid = 50042697
TargetCannabinoid receptor 2(Homo sapiens (Human))
Boehringer Ingelheim Pharma
Curated by ChEMBL
LigandPNGBDBM50042697(CHEMBL3353878)
Affinity DataEC50:  4.70nM. Assay description: Agonist activity at human CB2 receptor expressed in CHO cells assessed as inhibition of forskolin-stimulated cAMP production after 30 mins
In DepthDetails ArticlePubMed
TargetCannabinoid receptor 1(Homo sapiens (Human))
Boehringer Ingelheim Pharma
Curated by ChEMBL
LigandPNGBDBM50042697(CHEMBL3353878)
Affinity DataEC50:  2.90E+4nM. Assay description: Agonist activity at human CB1 receptor expressed in CHO cells assessed as inhibition of forskolin-stimulated cAMP production after 30 mins
In DepthDetails ArticlePubMed