BDBM50042713 3-(5-Methyl-1H-imidazol-4-yl)-1-(1-methyl-1H-indol-3-yl)-propan-1-one::3-(5-Methyl-3H-imidazol-4-yl)-1-(1-methyl-1H-indol-3-yl)-propan-1-one (GR 65630)::CHEMBL122903::GR-65630
SMILES Cc1nc[nH]c1CCC(=O)c1cn(C)c2ccccc12
InChI Key InChIKey=QZNZJWLUNDXZQA-UHFFFAOYSA-N
Data  1 KI
  Tab Delimited (TSV)   2D SDfile   Computed 3D by Vconf -m prep SDfile
Find this compound or compounds like it in BindingDB:
Activity Spreadsheet -- Enzyme Inhibition Constant Data from BindingDB
Found 1 hit for monomerid = 50042713
Target5-hydroxytryptamine receptor 3A/3B(Rattus norvegicus)
Solvay Duphar
Curated by ChEMBL
LigandPNGBDBM50042713(3-(5-Methyl-1H-imidazol-4-yl)-1-(1-methyl-1H-indol...)
Affinity DataKi:  0.280nM. Assay description: The binding affinity of the compound was measured on glycine receptor using [3H]- strychnine as radioligand.
In DepthDetails ArticlePubMed