BDBM50042775 (3-Methoxy-benzyl)-(6,7,8-trimethoxy-quinazolin-4-yl)-amine::CHEMBL338642
SMILES COc1cccc(CNc2ncnc3c(OC)c(OC)c(OC)cc23)c1
InChI Key InChIKey=IATGPZYGDJTYBV-UHFFFAOYSA-N
Data  1 IC50
  Tab Delimited (TSV)   2D SDfile   Computed 3D by Vconf -m prep SDfile
Find this compound or compounds like it in BindingDB:
Activity Spreadsheet -- Enzyme Inhibition Constant Data from BindingDB
Found 1 hit for monomerid = 50042775
TargetcGMP-specific 3',5'-cyclic phosphodiesterase(Homo sapiens (Human))
Eisai
Curated by ChEMBL
LigandPNGBDBM50042775((3-Methoxy-benzyl)-(6,7,8-trimethoxy-quinazolin-4-...)
Affinity DataIC50:  1.70E+3nM. Assay description: Inhibitory activity against cyclic GMP-phosphodiesterase (PDE V) isolated from porcine aorta.
In DepthDetails ArticlePubMed