BDBM50042957 3-(3,4-Dihydroxy-phenyl)-1-(2,6-dimethoxy-phenyl)-propenone::CHEMBL126647
SMILES COc1cccc(OC)c1C(=O)\C=C\c1ccc(O)c(O)c1
InChI Key InChIKey=ZJGOSGRZVNPMOZ-VQHVLOKHSA-N
Data  1 IC50
  Tab Delimited (TSV)   2D SDfile   Computed 3D by Vconf -m prep SDfile
Find this compound or compounds like it in BindingDB:
Activity Spreadsheet -- Enzyme Inhibition Constant Data from BindingDB
Found 1 hit for monomerid = 50042957
TargetPolyunsaturated fatty acid 5-lipoxygenase(Rattus norvegicus)
Tokushima Bunri University
Curated by ChEMBL
LigandPNGBDBM50042957(3-(3,4-Dihydroxy-phenyl)-1-(2,6-dimethoxy-phenyl)-...)
Affinity DataIC50:  370nM. Assay description: In vitro inhibition against 5-lipoxygenase in RBL-1 cells was determined
In DepthDetails ArticlePubMed