BDBM50042966 3-(3,4-Dihydroxy-phenyl)-1-(2,5-dihydroxy-phenyl)-propenone::CHEMBL125800
SMILES Oc1ccc(O)c(c1)C(=O)\C=C\c1ccc(O)c(O)c1
InChI Key InChIKey=PFOGPGPNRKORCH-DAFODLJHSA-N
Data  2 IC50
  Tab Delimited (TSV)   2D SDfile   Computed 3D by Vconf -m prep SDfile
Find this compound or compounds like it in BindingDB:
Activity Spreadsheet -- Enzyme Inhibition Constant Data from BindingDB
Found 2 hits for monomerid = 50042966
TargetXanthine dehydrogenase/oxidase(Bos taurus (Bovine))
Northern Kentucky University
Curated by ChEMBL
LigandPNGBDBM50042966(3-(3,4-Dihydroxy-phenyl)-1-(2,5-dihydroxy-phenyl)-...)
Affinity DataIC50:  1.70E+4nM. Assay description: Inhibition of bovine xanthine oxidase assessed as conversion of xanthine to uric acid by spectroscopic analysis
In DepthDetails ArticlePubMed
TargetPolyunsaturated fatty acid 5-lipoxygenase(Rattus norvegicus)
Tokushima Bunri University
Curated by ChEMBL
LigandPNGBDBM50042966(3-(3,4-Dihydroxy-phenyl)-1-(2,5-dihydroxy-phenyl)-...)
Affinity DataIC50:  64nM. Assay description: In vitro inhibition against 5-lipoxygenase in RBL-1 cells was determined
In DepthDetails ArticlePubMed