BDBM50043244 4'-(1-Methyl-2'-propyl-1H-[2,5']bibenzoimidazolyl-3'-ylmethyl)-biphenyl-2-carboxylic acid::CHEMBL130910
SMILES CCCc1nc2ccc(cc2n1Cc1ccc(cc1)-c1ccccc1C(O)=O)-c1nc2ccccc2n1C
InChI Key InChIKey=MPBWDDNKHWTFRB-UHFFFAOYSA-N
Data  1 IC50
  Tab Delimited (TSV)   2D SDfile   Computed 3D by Vconf -m prep SDfile
Find this compound or compounds like it in BindingDB:
Activity Spreadsheet -- Enzyme Inhibition Constant Data from BindingDB
Found 1 hit for monomerid = 50043244
TargetType-1 angiotensin II receptor B(RAT)
Dr. Karl Thomae
Curated by ChEMBL
LigandPNGBDBM50043244(4'-(1-Methyl-2'-propyl-1H-[2,5']bibenzoimidazolyl-...)
Affinity DataIC50:  3nM. Assay description: Inhibition of specific binding of [125I]-angiotensin-II to angiotensin 1 receptor in rat lung membrane preparation
In DepthDetails ArticlePubMed